Home

Error: redefinition of module YogaKit react native

YogaKit ModuleMap Missing. So idk what even happened, but for some reason, my project (0.62.2) started failing to build when trying to archive it into a .ipa file for deploying on TestFlight. I tried to just create a new sample app at both versions (0.62.2 and 0.63.2) and go through the TestFlight deployment process, but I also get the same error Known Issues. When building a framework that has module maps in both the source and the install directories that define the same module, the compiler will show a redefinition message. (28638816) Workaround: Rename the module map file in the source directory to a non-default name (the default name is. module.modulemap. or 2. Check your project AND target's 'Build Settings', search with keyword 'valid_archs', if valid_archs config item exists, make sure the value for key DEBUG is 'arm64 armv7 x86_64', in other words, make sure the value contains x86_64. Share. answered Jan 8 at 2:41 After upgrading from 0.47.2 -> 0.48.0, I can't get XCode to build anymore. I've tried clearing out derived data, cleaning the project, etc. It's consistently failing with this error, across various react-native-* modules I have installed I kinda fix it by following the workaround suggested here:. Known Issues When building a framework that has module maps in both the source and the install directories that define the same module, the compiler will show a redefinition message

The changes in 0.60.0 to integrate CocoaPods by default are causing build failures if your Podfile includes use_frameworks!. use_frameworks! is a very commonly used CocoaPods option and it is required by many pods. Prior to 0.60.0 it worked fine with the React Native podspec Make sure to go to the ios folder and run pod update inside it. Remember to open the workspace file in the XCode (not a project). Do full clean/build cycle. I'm just going to add on to this point here that if you are running using xcodebuild, you also need to target the workspace -workspace instead of -project Snack, code example, screenshot, or link to a repository: Screenshot. Reproducible demo. npx react-native init AwesomeProject; npx react-native run-io Most of the tools in the android-ndk-r10e toolchain that react-native uses cannot properly interpret paths of more than 260 characters. react native posts error: can't find module 'prepack' 2. App is not running on iOS for latest version of react-native. 0 React Native version: MacOS: 10.15.4 Xcode: 11.4 RN: 0.62.0-rc.5 RN Cli: 4.8.0 Steps To Reproduce. Provide a detailed list of steps that reproduce the issue. react-native init App; react-native run-ios - Works fine; Open App.xcworkspace, select mac as a target and clean build. Expected Results. Application working on Mac too

I am trying to add a babel plugin for react native project generated from react native starter. The babel plugin works fine on react project (generated from cra) and also on electron app using react . But it doesn't work as expected on react-native one Steps To Reproduce. Provide a detailed list of steps that reproduce the issue. run npx react-native init Blah --template react-native-template-typescript. run npx react-native start. run npx react-native run-android. Tell app to use debug mode. See exception Common React Native errors. We've put together a quick checklist to help teams troubleshoot the most common causes for build failures. Here's what you can to do quickly diagnose and likely resolve build errors: Clone your repo and check if your app builds locally. Double check your third party dependencies. Make sure your app is configured.

React Native: java.lang.RuntimeException: Catalyst Instance has already disappeared: requested by WebSocketModule - react-native hot 67 Cant build react native from box in XCode: 'event2/event-config.h' file not found hot 6 Fantashit December 22, 2020 6 Comments on [0.48.0]: Error: Redefinition of RCTMethodInfo. After upgrading from 0.47.2 -> 0.48.0, I can't get XCode to build anymore. I've tried clearing out derived data, cleaning the project, etc In this post I'll walk through how to get the default React Native project to build in Xcode 12.4 on Apple silicon. The steps are the same as the ones I followed to update my app, but I'll use the default project to keep things relevant

(react-native run-android) -> Error: Command failed: ./gradlew installDebug hot 88 Unknown failure cmd: Can't find service: package hot 88 native_modules.gradle file is not downloading hot 7 Creating and Building a React Native Project. Starting React Native Project in Apple Mac M1 Chip System is published by Karthik Balasubramanian in Timeless When building a framework that has module maps in both the source and the install directories that define the same module, the compiler will show a redefinition message. (28638816) Workaround: Rename the module map file in the source directory to a non-default name (the default name is. ), and set the Module Map File build setting

New Answers to Old Questions Headquarters - 2021-01-24 (page 1 of 2) Natty. 12:00 AM I was able to create a brand new React Native project and run it in a simulator no problem so it seems to be an issue with existing projects. Posted by AustinAndrew As you may know, Traveloka already has iOS & Android application and we have been researching about React Native since October 2016. The goal is to reap the benefit of React Native in our mai

yogakit/yogakit.modulemap' not found React Native → 10 thoughts on ng update to v8 causes [error] Error: Job name.getProjectMetadata does not exist. Anonymous says Bug or feature request? Feature request. Expected behavior. When I have a Droppable container with horizontal layout and limited width (let's say it fits 3 draggable items) and height (let it be double height of a draggable item), I'd like to have an ability to drag and drop items in 2 rows inside the container when the number of items is more than 3

This website uses cookies to improve your experience while you navigate through the website. Out of these, the cookies that are categorized as necessary are stored on your browser as they are essential for the working of basic functionalities of the website The extends: eslint:recommended property in a configuration file enables rules that report common problems, which have a check mark below. The --fix option on the command line automatically fixes problems (currently mostly whitespace) reported by rules which have a wrench below Hi all, I'm new to CircleCI for mobile apps even if I use the plateform for backend CI/CD all the time. I'm having trouble building an iOS app on CircleCi with fastlane. The build works nicely locally but seems to be adımlarını takip edip; Xcode'a tam disk erişimi verdikten sonra clean işleminden sonra build almayı deneyebilirsiniz. Ek olarak zaten tam disk erişimi verildiği halde bu hatayı almaya devam ediyorsanız , projenize ait .xcworkspace dosyasını açıp Build Settings bildirimlerini uygulayın. Ardından tekrar clean yapıp tekrar build.

Flow Upgrade. The version of Flow which React Native uses has been updated in 0.62. The means that you need to make sure that the flow-bin dependency you have is set to ^0.113.0 and you have the same value in the [version] your .flowconfig file.. If you are using Typescript for type checking you code then you can actually remove the .flowconfig file and the flow-bin dependency and ignore this. 157} 157} 158: release {158: release {159 // Caution! In production, you need to generate your own keystore file. 159 // Caution! In production, you need to generate your own keystore file React Native 0.64 includes Hermes opt-in on iOS and React 17. Official blog post about the major changes on React Native 0.64; React Native 0.64 changelo ReactNativeの開発環境を構築する$ react-native run-ios して、Simulator に表示されるまで時間がかかるので、待つ。$ vi App.js して、 Step One をHello Step One に変更して、保存すると、画面がリロードされる。実機で動かす場合は、 reactNa

YogaKit ModuleMap Missing : reactnativ

Unfunded # 546 created by talibbk. $0.00. Recent activities. abner01061998 cancelled funding $ 5.00 for mauron85/ react-native-background-geolocation#533. 15 days ago. abner01061998 funded $ 5.00 for mauron85/react-native-background-geolocation# 533. 19 days ago My average was about 110-120 Mbit/s for download and 25 Mbit/s for upload. My mobile phone connected to the same WiFi can download at 250 Mbit/s. I couldn't make the morrownr/88x2bu's driver to work in a USB3 mode so I'm stuck at USB2.. Still 120 Mbit/s is good enough until I buy a WiFi dongle that will be instantly recognised by a freshly installed Linux distro Recently we have received many complaints from users about site-wide blocking of their own and blocking of their own activities please go to the settings off state, please visit

redefinition of module error since Apple Developer Forum

Besides React style programming, Yoga is another cool feature of React Native. It is a cross-platform layout engine which implements Flexbox so we use the same layout code for both platforms. A React Native 0.60 includes Cocoapods integration by default, AndroidX support, auto-linking libraries, a brand new Start screen and more. Check out Upgrade Support if you are experiencing issues related to React Native during the upgrading process. Keep in mind that RnDiffApp and rndiffapp are placeholders Why am I getting this redefinition of class error?, Why am I getting this redefinition of class error? c++ class redefinition. Apologies for the code dump: gameObject.cpp: #include error: redefinition of class. Ask Question Asked 6 years, 2 months ago. Active 3 months ago. Viewed 34k times 8. 6. Here's my code: // in main.cpp #include iostrea

Note: If you run into a React Component Arrow Function Unexpected Token error, make sure that JavaScript ES6 is available for your React application. Normally when using create-react-app this should be given, otherwise, if you set up the project yourself, Babel is enabling ES6 and beyond features for your React application Release 0.62 React Native 0.62 includes built-in integration with Flipper. Official blog post about the major changes on React Native 0.62 [External] Tutorial on upgrading to React Native 0.6 Select File > Project structure from the Android Studio toolbar. Select SDK Location from the left-hand menu. Make sure the Use embedded JDK checkbox is selected. If this doesn't solve the problem, then navigate back to File > Project structure > SDK Location, and manually enter the full file path for your JDK 2.1 Install the SDK using Yarn or NPM. Yarn: yarn add react-native-onesignal. NPM npm install --save react-native-onesignal. 2.2 Link OneSignal (for RN versions < 0.60) If using React Native version of 0.60 or greater, autolinking is now done automatically so skip to step 3

ios - fatal error: module map file YogaKit

[0.48.0]: Error: Redefinition of RCTMethodInfo · Issue ..

  1. dotenv, Dotenv is a zero-dependency module that loads environment variables from a .env file into process.env. express-validator , express-validator is a set of express.js middlewares that wraps.
  2. The simulators have a profile we install on them (which has the type com.apple.sso). It did not change for a while and it's still working on simulators running iOS 12- We tried to upgrade to com.apple.extensiblesso, however, from my understanding, this requires the device to be handled by an MDM to inject the profile
  3. Create a new SwiftUI app In its ContentView file, add some content Run the project in the iOS Simulator Select the project in the Project navigator and in the File Inspector, change the Project Format dropdown menu to Xcode 11.4-compatible or Xcode 12-compatible. Quit the Xcode beta and the Simulator. Use xcode-select to set your environment.
  4. Error: EPERM: operation not permitted, mkdir 'C:\Users\SHUBHAM~KUNWAR' command not found: create-react-app command not found: create-react-app get product image woocommerc
  5. Dependabot will resolve any conflicts with this PR as long as you don't alter it yourself. You can also trigger a rebase manually by commenting @dependabot rebase. Dependabot commands and options. You can trigger Dependabot actions by commenting on this PR: @dependabot rebase will rebase this PR
  6. typedef redefinition with different types ('uint8_t' (aka 'unsigned char') vs 'enum clockid_t') react native 2. When will the validation functions be called in the react j
  7. Declare x as a global variable at the command line, and display its value. global x x. x = 42. Change the value of x and use the function that you defined in the previous example to return the global value from a different workspace. x = 1701; r = getGlobalx. r = 1701

RSKImageCropper Redefinition of module cause by bug in

1. In order to do a good job, we must first use its tools and build our development environment use firstnpm init -yCreate the initialization configuration file, and then download the development dependencies we need later: npm i webpack webpack-cli webpack-dev-server html-webpack-plugin --save-dev newly buildwebpack.config.jsUsed to writewebpackConfiguration, newsrc/index.jsAs the project. In an object destructuring pattern, shape: Shape means grab the property shape and redefine it locally as a variable named Shape.Likewise xPos: number creates a variable named number whose value is based on the parameter's xPos.. readonly Properties. Properties can also be marked as readonly for TypeScript. While it won't change any behavior at runtime, a property marked as readonly can.

[iOS] RN 0.60.0-rc.2 fails to build with CocoaPods ..

  1. typedef redefinition with different types ('uint8_t' (aka 'unsigned char') vs 'enum clockid_t') react native; awk delimiter semi-colon; calcul md5 fichier linux; vue npm install TypeError: Cannot read property 'upgrade' of undefined; cancel jobs related to one name; how to increase maximum upload file size in wordpress stack; rpm repo modular dat
  2. i. The installation continues until restart. The external drive cannot be used to boot up
  3. React native photo editor library. ReactNative: Native Photo Editor (Android/iOS) If this project has helped you out, please support us with a star This library is a React Native bridge around native photo editor libraries. It allows you to edit any photo by providing below set of features: Cropping; Adding Images -Stickers-Adding Text.
  4. imalistic with respect to memory usage. It supports connections to multiple Redis servers. It runs on Linux, OS X, Windows, FreeBSD and should.
  5. 最近做了一个项目,用的react-native 开发的iso项目。 由于自己没有oc基础,所以该项目几乎全用js写得。(顺便说一下,react-native 开发,最好还是学一下原生,起码的看得懂,不然搞配置一抓一把黑) 1:关于真机调试 这里的真机调试,指的是在iphone设备上面运行你的react native 项目,那么要让我们的.
  6. DEV Community is a community of 663,940 amazing developers . We're a place where coders share, stay up-to-date and grow their careers

Tutorial failing to build with 'modulemap' · Issue #523

  1. al as well
  2. Module cache pruning attempts to clear out old, unused module files so that the module cache itself does not grow without bound. The default delay is large (604,800 seconds, or 7 days) because this is an expensive operation. Set this value to 0 to turn off pruning. -fmodules-prune-after=seconds
  3. When the property already exists, Object.defineProperty() attempts to modify the property according to the values in the descriptor and the object's current configuration. If the old descriptor had its configurable attribute set to false the property is said to be non-configurable. It is not possible to change any attribute of a non-configurable accessor property
  4. By: Donagh McCarthy 1.5; [ Natty ] ruby Timer RSpec Test Ruby By: Seirif 2.0; [ Natty ] java Hadoop cluster setup - java.net.ConnectException: Connection refused By: nataku981 1.0; [ Natty ] python-3.x how to interpolate the section-name with configparser By: andy20170414 1.0
  5. Examples of Content related issues. Software related issues. For queries regarding questions and quizzes, use the comment area below respective pages

New Answers to Old Questions Headquarters - 2017-10-23 (page 1 of 4) Natty. 12:03 AM. [ Natty ] c# Find covariance of Math Net matrix By: tearvisus 0.5; [ Natty ] javascript Simulate a click on 'a' element using javascript/jquery By: RVNOR 2.0; [ Natty ] jenkins Jenkins Global Security - Null Pointer Exception while saving settings By: Andrew 2.0 load a component on button click react. onClick button react send to another component. onclick on fragment react. onpress not working with usestate react native. onpress setstate react native. pass text to button component react. react function exec when button is clicked I'd like to be able to develop for Apple Silicon, but as a small independent developer, it seems to be getting expensive to develop for Apple these days and I'm struggling to keep up. I don't really want to sell my 5K iMac to get an M1 Mac Mini or MacBook Air. Seems like a backward step Definition and Usage. The grid-row property specifies a grid item's size and location in a grid layout, and is a shorthand property for the following properties:: grid-row-start. grid-row-end. Default value

解决Error: Cannot find module 'fs/promises'问题 问题描述: 安装slidev报错 解决 方法: 更行node版本到最新稳定版本(不同系统如下): 1.window 系统卸载重装node 2.苹果自查 3.linux有对应 解决 方 Can't get iOS push notification device token in react-native; How do I load a specific url on refresh? Why does tail probability in apache math drop to zero after 1E-16? How to call a function only Once in Python [closed] How can I get the size of an array in C / Objective-C? Python Sockets use function instead of global socket cal NSString alloc/init generates 'Redefinition of myStr' error? R squared and adjusted R squared with one predictor data not post through webservice json in io storesafe/cordova-sqlite-evcore-extbuild-free plugin version with Android JSON and SQL statement handling implemented in C, as well as support for Intel XDK, PhoneGap Build, etc. (GPL v3 or commercial license terms) - handles large SQL batches in less than half the time as this plugin version

Cannot open %include file sas. Solved: %include difficulties, And they are resulting in the errors: `Error: Cannot open %include I've read that it has to do with the actual file destinations, but `base.sas` is ERROR: Cannot open %INCLUDE file 'C:\Users\Anth\Documents\SASUniversityEdition\SAS_Macro\SAS_Macro'\setup.sas. So far I've tried referencing the path of the folder shortcut, in which the. exit: redefinition; '__declspec(noreturn)' or '[[noreturn]]' post data with esp8266; Segmentation fault (core dumped) mpi_bcast; cplusplusbtutotrail; sento freddo a un dente; the amount of input is unknown; sfml disable message; hackerearth3; a variable with 2 independant variables plot; unambiguous; error: 'std::high_resolution_clock' has not. In your command line, where the react native application is located, run the following: npx react-native run-android. Copy. Building as You Iterate# As you work through these guides and iterate on your native module, you. React Custom Hook: useSubmit. Murat Catal. Follow. Oct 13, 2019 · 2 min read. Photo by John Schnobrich on Unsplash

The React-Native build system can be fairly complex, and as a native module we don't have control on all the other dependencies our users may have and on how Folly is compiled by those deps. However it is our understanding that the clock_gettime fallback can end up getting pulled in either when a dep supports iOS platforms < 10 (which triggers.

« first day (630 days earlier) ← previous day next day → last day (983 days later) :I've got a simple composite component which has to render a inputText. When a put the value and press commandButton the follow exception is throw:java.lang.IllegalArgumentException: Cannot convert 1 of type class java.lang.String to class sample.entity Checkout Newegg's popular product drawing queue. Enter your product of choice, submit your email, and wait to see if you win! All customers who win will be given the chance to purchase highly popular products error: extern declaration of 'i' follows declaration with no linkage; Extract column names with value 1 in binary matrix; Converting .so file of linux to a .dll file of windows; Limit results autocomplete jquery ui with slice function; Have installed matplotlib 3 times still get error: ImportError: No module named backends.backend_wx React JS Best Practices | Hacker News. girvo on May 9, 2015 [-] > Flux is also quite verbose, which makes it inconvenient for data state, state that is persisted to the server. We felt the same way, until we moved away from Facebook's Flux implementation and adopted Flummox [0]

Does not work with axemclion/react-native-cordova-plugin since the window.sqlitePlugin object is NOT properly exported (ES5 feature). It is recommended to use andpor/react-native-sqlite-storage for SQLite database access with React Native Android/iOS instead The principal square root function f(x) = √ x (usually just referred to as the square root function) is a function that maps the set of nonnegative real numbers onto itself. In geometrical terms, the square root function maps the area of a square to its side length. The square root of x is rational if and only if x is a rational number that can be represented as a ratio of two perfect squares

Video: Declaration of 'YGValue must be imported from module 'yoga